>>652
返答ありがとうございます

hg コマンドなる物でupdateしてビルドし直したら行けました!

しかし進行中に
make[2]: *** [test] Error 1
make[1]: *** [http.test] Error 2
make: *** [run] Error 2

errがでて

今度は
cl.go:7: fatal error: can't find import: draw

drowが呼び出せませんでした
なぜでしょう