>>299
こりゃどーもすまんです。
perl.hとかperlvars.hで氏ぬほどsyntax errorが出てるのですが

In file included from /usr/lib/perl5/5.8.2/cygwin-thread-multi-64int/CORE/perl.h:2349,
from Parser.xs:19:
/usr/lib/perl5/5.8.2/cygwin-thread-multi-64int/CORE/scope.h:221: error: syntax error before "sigjmp_buf"
/usr/lib/perl5/5.8.2/cygwin-thread-multi-64int/CORE/scope.h:221: warning: no semicolon at end of struct or union
/usr/lib/perl5/5.8.2/cygwin-thread-multi-64int/CORE/scope.h:228: error: syntax error before '}' token
(Snip)
In file included from /usr/lib/perl5/5.8.2/cygwin-thread-multi-64int/CORE/perlapi.h:37,
from /usr/lib/perl5/5.8.2/cygwin-thread-multi-64int/CORE/XSUB.h:313,
from Parser.xs:20:
/usr/lib/perl5/5.8.2/cygwin-thread-multi-64int/CORE/perlvars.h:31: error: syntax error before '*' token
/usr/lib/perl5/5.8.2/cygwin-thread-multi-64int/CORE/perlvars.h:31: warning: data definition has no type or storage class
(Snip)
/usr/lib/perl5/5.8.2/cygwin-thread-multi-64int/CORE/perlvars.h:52: error: syntax error before '*' token
/usr/lib/perl5/5.8.2/cygwin-thread-multi-64int/CORE/perlvars.h:52: warning: data definition has no type or storage class
make: *** [Parser.o] Error 1
/bin/make.exe -j3 -- NOT OK
Running make test
Can't test without successful make
Running make install
make had returned bad status, install seems impossible

こんな感じです。
perl.hが悪いとか言われても(;´Д`)