GRUBのコンパイルでエラーが出たので質問します。
あまりLinuxに詳しくないので、ヘタレな質問内容ですが・・。
pre_stage2_exec-terminfo.o(.text+0x241): In function `ti_set_term':
: undefined reference to `memcpy'
pre_stage2_exec-terminfo.o(.text+0x269): In function `ti_get_term':
: undefined reference to `memcpy'
collect2: ld returned 1 exit status
make[2]: *** [pre_stage2.exec] Error 1
make[2]: Leaving directory `/tools/src/lfs-packages/grub-0.93/stage2'
make[1]: *** [all-recursive] Error 1
make[1]: Leaving directory `/tools/src/lfs-packages/grub-0.93'
make: *** [all] Error 2
と表示され、停止しました。よく分からないんですが、僕の解釈では
ti_set_termって関数が定義されていないか何かで、コンパイルエラーになる、
→terminfo(だったかな?)のヘッダがないとかが原因?
と思ったんですが、違ってますか?あ、笑わないで下さいね。
GRUBのコンパイルを成功させるには、どうするべきなのでしょうか?
LFSは5.0です。